If you have trouble registering or do not receive a verification e-mail, please ask for help in chat.

New install - Various issues

Get support for Unvanquished.
themuffinator
Posts: 4
Joined: Sun Mar 29, 2020 8:36 pm UTC

New install - Various issues

Postby themuffinator » Sun Mar 29, 2020 9:23 pm UTC

Hi All,

First off I must say I've watched this project for years and now that I find myself with some time on my hands (thanks Coronavirus!) I decided to try Unvanquished out again. My interest lies more in the engine capabilities rather than the gameplay and Daemon certainly is the most impressive advancement of idTech3 out there.

That said, I've run into some issues which I can't seem to find an answer to. Rather than post a bunch of threads I thought I'd bundle everything together. My setup:

Win 10
i5-9300h
GTX 1050
GL_VERSION: 4.6.0 NVIDIA 442.74

I have the latest drivers. Here are the problems I've run into:

1. The installer did its thing then closed without providing any shortcuts to the game or options to have as such - a minor issue but shouldn't happen?

2. I can't use condump. Example output would be:

Code: Select all

/condump dump.txt
Failed to open 'condump/' for writing: Filename contains invalid characters

Warn: couldn't open.

I have run the game as administrator which made no difference.

3. Shadow maps don't work. I've used both GPU's - my Intel UHD 630 draws a line/artifact on the ground and GeForce shows nothing at all (no difference visually to no shadow at all). No errors show in the console, even with r_debugShadowMaps 1. vid_restart or even reloading the game made no difference.

4. Dynamic lights: SMG firing dlight (which should last for a fraction of a second) lingers around for about 20 seconds. The dynamic lights menu option doesn't seem to make any difference to any dlights.

5. Maybe more of a suggestion but more informative loading should be an improvement? Specifically the black screen when the engine initializes (before the menu is drawn) should indicate a loading status so you know something is happening. Map loading has a strange delay before the connection/precaching screens,

6. I am hoping to get right into coding. Having modded ioq3 engine and vms in the past I thought it would be a breeze to compile cgame/sgame but I was wrong. As there is no makefile I used CMake but alas it gives an error when generating:

Code: Select all

Error in configuration process, project files may be invalid

It works when disabling BUILD_SGAME and this happens both for MinGW32 and VS2019. Here's the MinGW CMakeError.log:

Code: Select all

Performing C++ SOURCE FILE Test FLAG_FVISIBILITY_HIDDEN failed with the following output:
Change Dir: C:/uv-game/build/CMakeFiles/CMakeTmp

Run Build Command(s):C:/MinGW/bin/mingw32-make.exe cmTC_c45e3/fast && C:/MinGW/bin/mingw32-make.exe -f CMakeFiles\cmTC_c45e3.dir\build.make CMakeFiles/cmTC_c45e3.dir/build

mingw32-make.exe[1]: Entering directory `C:/uv-game/build/CMakeFiles/CMakeTmp'

Building CXX object CMakeFiles/cmTC_c45e3.dir/src.cxx.obj

C:\MinGW\bin\g++.exe    -ffast-math -fno-strict-aliasing -m32 -msse2 -mtune=generic -mfpmath=sse -DFLAG_FVISIBILITY_HIDDEN   -fvisibility=hidden -o CMakeFiles\cmTC_c45e3.dir\src.cxx.obj -c C:\uv-game\build\CMakeFiles\CMakeTmp\src.cxx

C:\uv-game\build\CMakeFiles\CMakeTmp\src.cxx: In function 'int main()':

C:\uv-game\build\CMakeFiles\CMakeTmp\src.cxx:1:24: warning: visibility attribute not supported in this configuration; ignored

Linking CXX executable cmTC_c45e3.exe

"C:\Program Files\CMake\bin\cmake.exe" -E cmake_link_script CMakeFiles\cmTC_c45e3.dir\link.txt --verbose=1

"C:\Program Files\CMake\bin\cmake.exe" -E remove -f CMakeFiles\cmTC_c45e3.dir/objects.a
C:\MinGW\bin\ar.exe cr CMakeFiles\cmTC_c45e3.dir/objects.a @CMakeFiles\cmTC_c45e3.dir\objects1.rsp
C:\MinGW\bin\g++.exe  -ffast-math -fno-strict-aliasing -m32 -msse2 -mtune=generic -mfpmath=sse -DFLAG_FVISIBILITY_HIDDEN    -Wl,--whole-archive CMakeFiles\cmTC_c45e3.dir/objects.a -Wl,--no-whole-archive  -o cmTC_c45e3.exe -Wl,--out-implib,libcmTC_c45e3.dll.a -Wl,--major-image-version,0,--minor-image-version,0 @CMakeFiles\cmTC_c45e3.dir\linklibs.rsp
mingw32-make.exe[1]: Leaving directory `C:/uv-game/build/CMakeFiles/CMakeTmp'



Source file was:
int main() { return 0; }
Performing C++ SOURCE FILE Test FLAG_OPTIMIZE_DEBUG failed with the following output:
Change Dir: C:/uv-game/build/CMakeFiles/CMakeTmp

Run Build Command(s):C:/MinGW/bin/mingw32-make.exe cmTC_243a3/fast && C:/MinGW/bin/mingw32-make.exe -f CMakeFiles\cmTC_243a3.dir\build.make CMakeFiles/cmTC_243a3.dir/build

mingw32-make.exe[1]: Entering directory `C:/uv-game/build/CMakeFiles/CMakeTmp'

Building CXX object CMakeFiles/cmTC_243a3.dir/src.cxx.obj

C:\MinGW\bin\g++.exe    -ffast-math -fno-strict-aliasing -m32 -msse2 -mtune=generic -mfpmath=sse -DFLAG_OPTIMIZE_DEBUG   -Og -o CMakeFiles\cmTC_243a3.dir\src.cxx.obj -c C:\uv-game\build\CMakeFiles\CMakeTmp\src.cxx

cc1plus.exe: error: invalid option argument '-Og'

mingw32-make.exe[1]: *** [CMakeFiles/cmTC_243a3.dir/src.cxx.obj] Error 1

mingw32-make.exe[1]: Leaving directory `C:/uv-game/build/CMakeFiles/CMakeTmp'

mingw32-make.exe: *** [cmTC_243a3/fast] Error 2



Source file was:
int main() { return 0; }
Performing C++ SOURCE FILE Test FLAG_GNUXX11 failed with the following output:
Change Dir: C:/uv-game/build/CMakeFiles/CMakeTmp

Run Build Command(s):C:/MinGW/bin/mingw32-make.exe cmTC_3ba31/fast && C:/MinGW/bin/mingw32-make.exe -f CMakeFiles\cmTC_3ba31.dir\build.make CMakeFiles/cmTC_3ba31.dir/build

mingw32-make.exe[1]: Entering directory `C:/uv-game/build/CMakeFiles/CMakeTmp'

Building CXX object CMakeFiles/cmTC_3ba31.dir/src.cxx.obj

C:\MinGW\bin\g++.exe    -ffast-math -fno-strict-aliasing -m32 -msse2 -mtune=generic -mfpmath=sse -DFLAG_GNUXX11   -std=gnu++11 -o CMakeFiles\cmTC_3ba31.dir\src.cxx.obj -c C:\uv-game\build\CMakeFiles\CMakeTmp\src.cxx

cc1plus.exe: error: unrecognized command line option "-std=gnu++11"

mingw32-make.exe[1]: *** [CMakeFiles/cmTC_3ba31.dir/src.cxx.obj] Error 1

mingw32-make.exe[1]: Leaving directory `C:/uv-game/build/CMakeFiles/CMakeTmp'

mingw32-make.exe: *** [cmTC_3ba31/fast] Error 2



Source file was:
int main() { return 0; }
Performing C SOURCE FILE Test FLAG_LINKER_Z_RELRO failed with the following output:
Change Dir: C:/uv-game/build/CMakeFiles/CMakeTmp

Run Build Command(s):C:/MinGW/bin/mingw32-make.exe cmTC_ecd78/fast && C:/MinGW/bin/mingw32-make.exe -f CMakeFiles\cmTC_ecd78.dir\build.make CMakeFiles/cmTC_ecd78.dir/build

mingw32-make.exe[1]: Entering directory `C:/uv-game/build/CMakeFiles/CMakeTmp'

Building C object CMakeFiles/cmTC_ecd78.dir/src.c.obj

C:\MinGW\bin\gcc.exe   -ffast-math -fno-strict-aliasing -m32 -msse2 -mtune=generic -mfpmath=sse -mms-bitfields -DFLAG_LINKER_Z_RELRO -Wl,-z,relro   -Wl,-z,relro -o CMakeFiles\cmTC_ecd78.dir\src.c.obj   -c C:\uv-game\build\CMakeFiles\CMakeTmp\src.c

Linking C executable cmTC_ecd78.exe

"C:\Program Files\CMake\bin\cmake.exe" -E cmake_link_script CMakeFiles\cmTC_ecd78.dir\link.txt --verbose=1

"C:\Program Files\CMake\bin\cmake.exe" -E remove -f CMakeFiles\cmTC_ecd78.dir/objects.a
C:\MinGW\bin\ar.exe cr CMakeFiles\cmTC_ecd78.dir/objects.a @CMakeFiles\cmTC_ecd78.dir\objects1.rsp
C:\MinGW\bin\gcc.exe  -ffast-math -fno-strict-aliasing -m32 -msse2 -mtune=generic -mfpmath=sse -mms-bitfields -DFLAG_LINKER_Z_RELRO -Wl,-z,relro    -Wl,--whole-archive CMakeFiles\cmTC_ecd78.dir/objects.a -Wl,--no-whole-archive  -o cmTC_ecd78.exe -Wl,--out-implib,libcmTC_ecd78.dll.a -Wl,--major-image-version,0,--minor-image-version,0 @CMakeFiles\cmTC_ecd78.dir\linklibs.rsp
c:/mingw/bin/../lib/gcc/mingw32/4.5.2/../../../../mingw32/bin/ld.exe: unrecognized option '-z'

c:/mingw/bin/../lib/gcc/mingw32/4.5.2/../../../../mingw32/bin/ld.exe: use the --help option for usage information

collect2: ld returned 1 exit status

mingw32-make.exe[1]: *** [cmTC_ecd78.exe] Error 1

mingw32-make.exe[1]: Leaving directory `C:/uv-game/build/CMakeFiles/CMakeTmp'

mingw32-make.exe: *** [cmTC_ecd78/fast] Error 2



Source file was:
int main(void) { return 0; }
Performing C SOURCE FILE Test FLAG_LINKER_Z_NOW failed with the following output:
Change Dir: C:/uv-game/build/CMakeFiles/CMakeTmp

Run Build Command(s):C:/MinGW/bin/mingw32-make.exe cmTC_8c252/fast && C:/MinGW/bin/mingw32-make.exe -f CMakeFiles\cmTC_8c252.dir\build.make CMakeFiles/cmTC_8c252.dir/build

mingw32-make.exe[1]: Entering directory `C:/uv-game/build/CMakeFiles/CMakeTmp'

Building C object CMakeFiles/cmTC_8c252.dir/src.c.obj

C:\MinGW\bin\gcc.exe   -ffast-math -fno-strict-aliasing -m32 -msse2 -mtune=generic -mfpmath=sse -mms-bitfields -DFLAG_LINKER_Z_NOW -Wl,-z,now   -Wl,-z,now -o CMakeFiles\cmTC_8c252.dir\src.c.obj   -c C:\uv-game\build\CMakeFiles\CMakeTmp\src.c

Linking C executable cmTC_8c252.exe

"C:\Program Files\CMake\bin\cmake.exe" -E cmake_link_script CMakeFiles\cmTC_8c252.dir\link.txt --verbose=1

"C:\Program Files\CMake\bin\cmake.exe" -E remove -f CMakeFiles\cmTC_8c252.dir/objects.a
C:\MinGW\bin\ar.exe cr CMakeFiles\cmTC_8c252.dir/objects.a @CMakeFiles\cmTC_8c252.dir\objects1.rsp
C:\MinGW\bin\gcc.exe  -ffast-math -fno-strict-aliasing -m32 -msse2 -mtune=generic -mfpmath=sse -mms-bitfields -DFLAG_LINKER_Z_NOW -Wl,-z,now    -Wl,--whole-archive CMakeFiles\cmTC_8c252.dir/objects.a -Wl,--no-whole-archive  -o cmTC_8c252.exe -Wl,--out-implib,libcmTC_8c252.dll.a -Wl,--major-image-version,0,--minor-image-version,0 @CMakeFiles\cmTC_8c252.dir\linklibs.rsp
c:/mingw/bin/../lib/gcc/mingw32/4.5.2/../../../../mingw32/bin/ld.exe: unrecognized option '-z'

c:/mingw/bin/../lib/gcc/mingw32/4.5.2/../../../../mingw32/bin/ld.exe: use the --help option for usage information

collect2: ld returned 1 exit status

mingw32-make.exe[1]: *** [cmTC_8c252.exe] Error 1

mingw32-make.exe[1]: Leaving directory `C:/uv-game/build/CMakeFiles/CMakeTmp'

mingw32-make.exe: *** [cmTC_8c252/fast] Error 2



Source file was:
int main(void) { return 0; }
Performing C++ SOURCE FILE Test FLAG_PTHREAD failed with the following output:
Change Dir: C:/uv-game/build/CMakeFiles/CMakeTmp

Run Build Command(s):C:/MinGW/bin/mingw32-make.exe cmTC_a9a08/fast && C:/MinGW/bin/mingw32-make.exe -f CMakeFiles\cmTC_a9a08.dir\build.make CMakeFiles/cmTC_a9a08.dir/build

mingw32-make.exe[1]: Entering directory `C:/uv-game/build/CMakeFiles/CMakeTmp'

Building CXX object CMakeFiles/cmTC_a9a08.dir/src.cxx.obj

C:\MinGW\bin\g++.exe    -ffast-math -fno-strict-aliasing -m32 -msse2 -mtune=generic -mfpmath=sse -std=gnu++0x -mms-bitfields -DFLAG_PTHREAD   -pthread -o CMakeFiles\cmTC_a9a08.dir\src.cxx.obj -c C:\uv-game\build\CMakeFiles\CMakeTmp\src.cxx

g++.exe: unrecognized option '-pthread'

Linking CXX executable cmTC_a9a08.exe

"C:\Program Files\CMake\bin\cmake.exe" -E cmake_link_script CMakeFiles\cmTC_a9a08.dir\link.txt --verbose=1

"C:\Program Files\CMake\bin\cmake.exe" -E remove -f CMakeFiles\cmTC_a9a08.dir/objects.a
C:\MinGW\bin\ar.exe cr CMakeFiles\cmTC_a9a08.dir/objects.a @CMakeFiles\cmTC_a9a08.dir\objects1.rsp
C:\MinGW\bin\g++.exe  -ffast-math -fno-strict-aliasing -m32 -msse2 -mtune=generic -mfpmath=sse -std=gnu++0x -mms-bitfields -DFLAG_PTHREAD    -Wl,--whole-archive CMakeFiles\cmTC_a9a08.dir/objects.a -Wl,--no-whole-archive  -o cmTC_a9a08.exe -Wl,--out-implib,libcmTC_a9a08.dll.a -Wl,--major-image-version,0,--minor-image-version,0 @CMakeFiles\cmTC_a9a08.dir\linklibs.rsp
mingw32-make.exe[1]: Leaving directory `C:/uv-game/build/CMakeFiles/CMakeTmp'



Source file was:
int main() { return 0; }
Performing C++ SOURCE FILE Test _Wno_error_extern_c_compat failed with the following output:
Change Dir: C:/uv-game/build/CMakeFiles/CMakeTmp

Run Build Command(s):C:/MinGW/bin/mingw32-make.exe cmTC_e3a68/fast && C:/MinGW/bin/mingw32-make.exe -f CMakeFiles\cmTC_e3a68.dir\build.make CMakeFiles/cmTC_e3a68.dir/build

mingw32-make.exe[1]: Entering directory `C:/uv-game/build/CMakeFiles/CMakeTmp'

Building CXX object CMakeFiles/cmTC_e3a68.dir/src.cxx.obj

C:\MinGW\bin\g++.exe    -ffast-math -fno-strict-aliasing -m32 -msse2 -mtune=generic -mfpmath=sse -std=gnu++0x -mms-bitfields -D_Wno_error_extern_c_compat -Werror   -Wno-error=extern-c-compat -o CMakeFiles\cmTC_e3a68.dir\src.cxx.obj -c C:\uv-game\build\CMakeFiles\CMakeTmp\src.cxx

cc1plus.exe: error: -Werror=extern-c-compat: No option -Wextern-c-compat

mingw32-make.exe[1]: *** [CMakeFiles/cmTC_e3a68.dir/src.cxx.obj] Error 1

mingw32-make.exe[1]: Leaving directory `C:/uv-game/build/CMakeFiles/CMakeTmp'

mingw32-make.exe: *** [cmTC_e3a68/fast] Error 2



Source file was:
int main() { return 0; }
Performing C++ SOURCE FILE Test _Wno_error_maybe_uninitialized failed with the following output:
Change Dir: C:/uv-game/build/CMakeFiles/CMakeTmp

Run Build Command(s):C:/MinGW/bin/mingw32-make.exe cmTC_e0c95/fast && C:/MinGW/bin/mingw32-make.exe -f CMakeFiles\cmTC_e0c95.dir\build.make CMakeFiles/cmTC_e0c95.dir/build

mingw32-make.exe[1]: Entering directory `C:/uv-game/build/CMakeFiles/CMakeTmp'

Building CXX object CMakeFiles/cmTC_e0c95.dir/src.cxx.obj

C:\MinGW\bin\g++.exe    -ffast-math -fno-strict-aliasing -m32 -msse2 -mtune=generic -mfpmath=sse -std=gnu++0x -mms-bitfields -D_Wno_error_maybe_uninitialized -Werror   -Wno-error=maybe-uninitialized -o CMakeFiles\cmTC_e0c95.dir\src.cxx.obj -c C:\uv-game\build\CMakeFiles\CMakeTmp\src.cxx

cc1plus.exe: error: -Werror=maybe-uninitialized: No option -Wmaybe-uninitialized

mingw32-make.exe[1]: *** [CMakeFiles/cmTC_e0c95.dir/src.cxx.obj] Error 1

mingw32-make.exe[1]: Leaving directory `C:/uv-game/build/CMakeFiles/CMakeTmp'

mingw32-make.exe: *** [cmTC_e0c95/fast] Error 2



Source file was:
int main() { return 0; }
Performing C++ SOURCE FILE Test _Wno_error_unused_but_set_parameter failed with the following output:
Change Dir: C:/uv-game/build/CMakeFiles/CMakeTmp

Run Build Command(s):C:/MinGW/bin/mingw32-make.exe cmTC_7256a/fast && C:/MinGW/bin/mingw32-make.exe -f CMakeFiles\cmTC_7256a.dir\build.make CMakeFiles/cmTC_7256a.dir/build

mingw32-make.exe[1]: Entering directory `C:/uv-game/build/CMakeFiles/CMakeTmp'

Building CXX object CMakeFiles/cmTC_7256a.dir/src.cxx.obj

C:\MinGW\bin\g++.exe    -ffast-math -fno-strict-aliasing -m32 -msse2 -mtune=generic -mfpmath=sse -std=gnu++0x -mms-bitfields -D_Wno_error_unused_but_set_parameter -Werror   -Wno-error=unused-but-set-parameter -o CMakeFiles\cmTC_7256a.dir\src.cxx.obj -c C:\uv-game\build\CMakeFiles\CMakeTmp\src.cxx

cc1plus.exe: error: -Werror=unused-but-set-parameter: No option -Wunused-but-set-parameter

mingw32-make.exe[1]: *** [CMakeFiles/cmTC_7256a.dir/src.cxx.obj] Error 1

mingw32-make.exe[1]: Leaving directory `C:/uv-game/build/CMakeFiles/CMakeTmp'

mingw32-make.exe: *** [cmTC_7256a/fast] Error 2



Source file was:
int main() { return 0; }
Performing C++ SOURCE FILE Test _Wno_error_unused_but_set_variable failed with the following output:
Change Dir: C:/uv-game/build/CMakeFiles/CMakeTmp

Run Build Command(s):C:/MinGW/bin/mingw32-make.exe cmTC_d1732/fast && C:/MinGW/bin/mingw32-make.exe -f CMakeFiles\cmTC_d1732.dir\build.make CMakeFiles/cmTC_d1732.dir/build

mingw32-make.exe[1]: Entering directory `C:/uv-game/build/CMakeFiles/CMakeTmp'

Building CXX object CMakeFiles/cmTC_d1732.dir/src.cxx.obj

C:\MinGW\bin\g++.exe    -ffast-math -fno-strict-aliasing -m32 -msse2 -mtune=generic -mfpmath=sse -std=gnu++0x -mms-bitfields -D_Wno_error_unused_but_set_variable -Werror   -Wno-error=unused-but-set-variable -o CMakeFiles\cmTC_d1732.dir\src.cxx.obj -c C:\uv-game\build\CMakeFiles\CMakeTmp\src.cxx

cc1plus.exe: error: -Werror=unused-but-set-variable: No option -Wunused-but-set-variable

mingw32-make.exe[1]: *** [CMakeFiles/cmTC_d1732.dir/src.cxx.obj] Error 1

mingw32-make.exe[1]: Leaving directory `C:/uv-game/build/CMakeFiles/CMakeTmp'

mingw32-make.exe: *** [cmTC_d1732/fast] Error 2



Source file was:
int main() { return 0; }
Performing C SOURCE FILE Test CMAKE_HAVE_LIBC_PTHREAD failed with the following output:
Change Dir: C:/uv-game/build/CMakeFiles/CMakeTmp

Run Build Command(s):C:/MinGW/bin/mingw32-make.exe cmTC_085b2/fast && C:/MinGW/bin/mingw32-make.exe -f CMakeFiles\cmTC_085b2.dir\build.make CMakeFiles/cmTC_085b2.dir/build

mingw32-make.exe[1]: Entering directory `C:/uv-game/build/CMakeFiles/CMakeTmp'

Building C object CMakeFiles/cmTC_085b2.dir/src.c.obj

C:\MinGW\bin\gcc.exe   -ffast-math -fno-strict-aliasing -m32 -msse2 -mtune=generic -mfpmath=sse -mms-bitfields -DCMAKE_HAVE_LIBC_PTHREAD   -o CMakeFiles\cmTC_085b2.dir\src.c.obj   -c C:\uv-game\build\CMakeFiles\CMakeTmp\src.c

Linking C executable cmTC_085b2.exe

"C:\Program Files\CMake\bin\cmake.exe" -E cmake_link_script CMakeFiles\cmTC_085b2.dir\link.txt --verbose=1

"C:\Program Files\CMake\bin\cmake.exe" -E remove -f CMakeFiles\cmTC_085b2.dir/objects.a
C:\MinGW\bin\ar.exe cr CMakeFiles\cmTC_085b2.dir/objects.a @CMakeFiles\cmTC_085b2.dir\objects1.rsp
C:\MinGW\bin\gcc.exe  -ffast-math -fno-strict-aliasing -m32 -msse2 -mtune=generic -mfpmath=sse -mms-bitfields -DCMAKE_HAVE_LIBC_PTHREAD    -Wl,--whole-archive CMakeFiles\cmTC_085b2.dir/objects.a -Wl,--no-whole-archive  -o cmTC_085b2.exe -Wl,--out-implib,libcmTC_085b2.dll.a -Wl,--major-image-version,0,--minor-image-version,0 @CMakeFiles\cmTC_085b2.dir\linklibs.rsp
CMakeFiles\cmTC_085b2.dir/objects.a(src.c.obj):src.c:(.text+0x36): undefined reference to `_imp__pthread_create'

CMakeFiles\cmTC_085b2.dir/objects.a(src.c.obj):src.c:(.text+0x4c): undefined reference to `_imp__pthread_detach'

CMakeFiles\cmTC_085b2.dir/objects.a(src.c.obj):src.c:(.text+0x6a): undefined reference to `_imp__pthread_join'

CMakeFiles\cmTC_085b2.dir/objects.a(src.c.obj):src.c:(.text+0x88): undefined reference to `pthread_atfork'

CMakeFiles\cmTC_085b2.dir/objects.a(src.c.obj):src.c:(.text+0x94): undefined reference to `_imp__pthread_exit'

collect2: ld returned 1 exit status

mingw32-make.exe[1]: *** [cmTC_085b2.exe] Error 1

mingw32-make.exe[1]: Leaving directory `C:/uv-game/build/CMakeFiles/CMakeTmp'

mingw32-make.exe: *** [cmTC_085b2/fast] Error 2



Source file was:
#include <pthread.h>

void* test_func(void* data)
{
  return data;
}

int main(void)
{
  pthread_t thread;
  pthread_create(&thread, NULL, test_func, NULL);
  pthread_detach(thread);
  pthread_join(thread, NULL);
  pthread_atfork(NULL, NULL, NULL);
  pthread_exit(NULL);

  return 0;
}

Determining if the function pthread_create exists in the pthreads failed with the following output:
Change Dir: C:/uv-game/build/CMakeFiles/CMakeTmp

Run Build Command(s):C:/MinGW/bin/mingw32-make.exe cmTC_b1c49/fast && C:/MinGW/bin/mingw32-make.exe -f CMakeFiles\cmTC_b1c49.dir\build.make CMakeFiles/cmTC_b1c49.dir/build

mingw32-make.exe[1]: Entering directory `C:/uv-game/build/CMakeFiles/CMakeTmp'

Building C object CMakeFiles/cmTC_b1c49.dir/CheckFunctionExists.c.obj

C:\MinGW\bin\gcc.exe   -ffast-math -fno-strict-aliasing -m32 -msse2 -mtune=generic -mfpmath=sse -mms-bitfields -DCHECK_FUNCTION_EXISTS=pthread_create   -o CMakeFiles\cmTC_b1c49.dir\CheckFunctionExists.c.obj   -c "C:\Program Files\CMake\share\cmake-3.16\Modules\CheckFunctionExists.c"

Linking C executable cmTC_b1c49.exe

"C:\Program Files\CMake\bin\cmake.exe" -E cmake_link_script CMakeFiles\cmTC_b1c49.dir\link.txt --verbose=1

"C:\Program Files\CMake\bin\cmake.exe" -E remove -f CMakeFiles\cmTC_b1c49.dir/objects.a
C:\MinGW\bin\ar.exe cr CMakeFiles\cmTC_b1c49.dir/objects.a @CMakeFiles\cmTC_b1c49.dir\objects1.rsp
C:\MinGW\bin\gcc.exe  -ffast-math -fno-strict-aliasing -m32 -msse2 -mtune=generic -mfpmath=sse -mms-bitfields -DCHECK_FUNCTION_EXISTS=pthread_create    -Wl,--whole-archive CMakeFiles\cmTC_b1c49.dir/objects.a -Wl,--no-whole-archive  -o cmTC_b1c49.exe -Wl,--out-implib,libcmTC_b1c49.dll.a -Wl,--major-image-version,0,--minor-image-version,0 @CMakeFiles\cmTC_b1c49.dir\linklibs.rsp
c:/mingw/bin/../lib/gcc/mingw32/4.5.2/../../../../mingw32/bin/ld.exe: cannot find -lpthreads

collect2: ld returned 1 exit status

mingw32-make.exe[1]: *** [cmTC_b1c49.exe] Error 1

mingw32-make.exe[1]: Leaving directory `C:/uv-game/build/CMakeFiles/CMakeTmp'

mingw32-make.exe: *** [cmTC_b1c49/fast] Error 2




Performing C++ SOURCE FILE Test _wd4068 failed with the following output:
Change Dir: C:/uv-game/build/CMakeFiles/CMakeTmp

Run Build Command(s):C:/MinGW/bin/mingw32-make.exe cmTC_75ba2/fast && C:/MinGW/bin/mingw32-make.exe -f CMakeFiles\cmTC_75ba2.dir\build.make CMakeFiles/cmTC_75ba2.dir/build

mingw32-make.exe[1]: Entering directory `C:/uv-game/build/CMakeFiles/CMakeTmp'

Building CXX object CMakeFiles/cmTC_75ba2.dir/src.cxx.obj

C:\MinGW\bin\g++.exe    -ffast-math -fno-strict-aliasing -m32 -msse2 -mtune=generic -mfpmath=sse -std=gnu++0x -mms-bitfields -D_wd4068 -Werror   /wd4068 -o CMakeFiles\cmTC_75ba2.dir\src.cxx.obj -c C:\uv-game\build\CMakeFiles\CMakeTmp\src.cxx

g++.exe: /wd4068: No such file or directory

mingw32-make.exe[1]: *** [CMakeFiles/cmTC_75ba2.dir/src.cxx.obj] Error 1

mingw32-make.exe[1]: *** Deleting file `CMakeFiles/cmTC_75ba2.dir/src.cxx.obj'

mingw32-make.exe[1]: Leaving directory `C:/uv-game/build/CMakeFiles/CMakeTmp'

mingw32-make.exe: *** [cmTC_75ba2/fast] Error 2



Source file was:
int main() { return 0; }
Performing C++ SOURCE FILE Test _Wno_error_unused_private_field failed with the following output:
Change Dir: C:/uv-game/build/CMakeFiles/CMakeTmp

Run Build Command(s):C:/MinGW/bin/mingw32-make.exe cmTC_da8cf/fast && C:/MinGW/bin/mingw32-make.exe -f CMakeFiles\cmTC_da8cf.dir\build.make CMakeFiles/cmTC_da8cf.dir/build

mingw32-make.exe[1]: Entering directory `C:/uv-game/build/CMakeFiles/CMakeTmp'

Building CXX object CMakeFiles/cmTC_da8cf.dir/src.cxx.obj

C:\MinGW\bin\g++.exe    -ffast-math -fno-strict-aliasing -m32 -msse2 -mtune=generic -mfpmath=sse -std=gnu++0x -mms-bitfields -D_Wno_error_unused_private_field -Werror   -Wno-error=unused-private-field -o CMakeFiles\cmTC_da8cf.dir\src.cxx.obj -c C:\uv-game\build\CMakeFiles\CMakeTmp\src.cxx

cc1plus.exe: error: -Werror=unused-private-field: No option -Wunused-private-field

mingw32-make.exe[1]: *** [CMakeFiles/cmTC_da8cf.dir/src.cxx.obj] Error 1

mingw32-make.exe[1]: Leaving directory `C:/uv-game/build/CMakeFiles/CMakeTmp'

mingw32-make.exe: *** [cmTC_da8cf/fast] Error 2



Source file was:
int main() { return 0; }


I imagine I'm missing something incredibly simple here but I can't figure it out.

Anyone with any solutions overall? Any help is apprectiated.
User avatar
killing time
Programmer
Posts: 117
Joined: Wed Jul 04, 2012 7:55 am UTC

Re: New install - Various issues

Postby killing time » Mon Mar 30, 2020 1:10 am UTC

1. Yeah I think there should be an option to open the game.

2. What is your Windows user name?

6. You are using GCC 4.5 which is like 10 years old. You need to get a newer version. http://mingw-w64.org/doku.php/download
If there is an option like Win32 threads vs. Pthreads, you should choose pthreads.

Visual Studio should work, though. What's wrong with it?
themuffinator
Posts: 4
Joined: Sun Mar 29, 2020 8:36 pm UTC

Re: New install - Various issues

Postby themuffinator » Tue Mar 31, 2020 9:28 am UTC

Thanks for the reply!

2. djdac... my Unvanquished folder is C:\Users\djdac\OneDrive\Documents\My Games\Unvanquished. It's the first computer I've had where OneDrive highjacks my documents folder.

4. An update on this: turns out dlights are limited to only 1 instance (ie: shoot SMG again and the old light disappears and reappears in your new location). Very weird, and seems like some kind of refreshing/updating issue?

6. Wow, I never realised there was a newer version - I always download from the same site and assumed that would be the latest :facepalm: . I've updated but it still doesn't change my CMake situation - I suppose I need to manually edit the makefile to make it compile sgame. Visual Studio situation is identical to MinGW - the lack of ability to add sgame to the makefile (or solution).
User avatar
killing time
Programmer
Posts: 117
Joined: Wed Jul 04, 2012 7:55 am UTC

Re: New install - Various issues

Postby killing time » Tue Mar 31, 2020 7:25 pm UTC

2. Interesting. Later I will try enabling OneDrive in a Windows 10 VM and see if I can reproduce the issue.

6. I guess you must have used the defunct original mingw project, instead of "mingw-w64" which is actively maintained.
You should never manually edit the generated makefile.
If it's not building an sgame, this is probably due to the configuration variables you have selected. Make sure BUILD_SGAME and any other SGAME options are checked.
themuffinator
Posts: 4
Joined: Sun Mar 29, 2020 8:36 pm UTC

Re: New install - Various issues

Postby themuffinator » Thu Apr 02, 2020 8:52 am UTC

Ok, so it turns out my Python scripts weren't set up properly. That has been fixed now, and I can build native cgame and sgame dlls and exe. However, t's not possible to build NaCl/nexe - is there a tutorial on how to set this up or is it possible to simply load the dlls instead?
User avatar
illwieckz
Project Head
Posts: 567
Joined: Sat Aug 11, 2012 7:22 pm UTC
Location: France
Contact:

Re: New install - Various issues

Postby illwieckz » Thu Apr 02, 2020 11:45 pm UTC

I don't know why nexes do not build on your end, the related SDK must be autodownloaded and configured by cmake at build time. Maybe you may paste a full build log on a public paste sharing website, and open an issue on the engine bug tracker to link it with a small description of the issue you're facing.

It's possible to load the dll instead by starting the engine this way:

Code: Select all

daemon -set vm.cgame.type 3 -set vm.sgame.type 3 [other options]


Note that options starting with a “-” like “-set” must be placed before options starting with a “+” (like “+map”).

The game will load, but until you fail to compile NaCl stuff, you may experience troubles when connecting servers hosting custom code (as you would not be able to run it), and almost all servers are running custom code…

But for game development, using dll is fine, especially because it makes debugging easier. You may then use those cmake options to build easy-to-debug dlls:

Code: Select all

-D'USE_BREAKPAD=OFF' -D'CMAKE_BUILD_TYPE=Debug' -D'USE_DEBUG_OPTIMIZE=OFF'


Side note: I noticed you forked the Dæmon engine under a new name. Nothing forbid this but it may be useful to know we make special efforts to make our engine reusable and when it is not yet, that's something we want to fix. One of our goal is that third-party game developers may not require to rebuild the engine at all. So I would recommend you to fork the Dæmon engine to tweak the few bits that are still required to be hardcoded, doing this in a feature branch you would be able to rebase on or merge with upstream master from time to time. If you have any engine improvement in mind, we encourage you to submit them upstream so they can be maintained with other features taking care to not break them. :smile:
This comment is licensed under cc ​​by 4 and antecedent.
User avatar
killing time
Programmer
Posts: 117
Joined: Wed Jul 04, 2012 7:55 am UTC

Re: New install - Various issues

Postby killing time » Fri Apr 03, 2020 10:31 am UTC

I managed to reproduce the condump issue by enabling OneDrive in Windows 10.

illwieckz wrote:The game will load, but until you fail to compile NaCl stuff, you may experience troubles when connecting servers hosting custom code (as you would not be able to run it), and almost all servers are running custom code…

This is not true. Actually, there is no real need for building NaCl modules unless you want to host your own server with custom gamelogic.

If you do still want to build NaCl gamelogic, one likely cause is that you have configured it with Python 3. The NaCl toolchain is py2-only.
User avatar
illwieckz
Project Head
Posts: 567
Joined: Sat Aug 11, 2012 7:22 pm UTC
Location: France
Contact:

Re: New install - Various issues

Postby illwieckz » Sun Apr 05, 2020 11:37 pm UTC

killing time wrote:[…] Actually, there is no real need for building NaCl modules unless you want to host your own server with custom gamelogic


Well, this looks to be a name for a custom gamelogic:
https://github.com/themuffinator/FnQ3-game
:grin:
This comment is licensed under cc ​​by 4 and antecedent.
themuffinator
Posts: 4
Joined: Sun Mar 29, 2020 8:36 pm UTC

Re: New install - Various issues

Postby themuffinator » Wed Apr 08, 2020 10:16 am UTC

The DLLs work - seems a longer time to load the game but nonetheless does the job :thumbup:

It was renamed as to avoid confusion and the engine changes I'm after for my project probably don't fit in with yours. Anyhow, after deliberating between using Daemon or RBDOOM3BFG as a base to restart an old Quake 3 project I decided to go for... Spearmint! A lot of the Daemon features are downright sexy (libRocket - nice!) but overall it would create a lot more work for us on the game logic side.

Thanks to both of you for the help and keep an eye out on my GitHub profile if you're curious as to how it all turns out!
User avatar
illwieckz
Project Head
Posts: 567
Joined: Sat Aug 11, 2012 7:22 pm UTC
Location: France
Contact:

Re: New install - Various issues

Postby illwieckz » Thu Apr 09, 2020 12:10 am UTC

Note that Spearmint is not maintained anymore and development has stopped in 2018. If you already have a project based on Quake 3 the gap would be smaller with Spearmint than with Dæmon, but with the risk of being alone on the engine maintenance. The gap from Quake 3 to Dæmon is still smaller than the gap from Quake 3 to RBDOOM-3-BFG, and Dæmon fixed some design issue neither Quake3, Spearmint or RBDOOM-3-BFG did, like the DPK format that prevent random downloaded PK3 to not mess with game files. Otherwise, I'm curious about your project. :grin:
This comment is licensed under cc ​​by 4 and antecedent.

Return to “Troubleshooting”

Who is online

Users browsing this forum: Majestic-12 [Bot] and 2 guests